{"text_format":"1","workbook":"xlsx","n_sheets":9,"sheets":["Info","Trial","Instructions","Setup","Classes","TB","FinInfo","AFS","TBImport"],"not_rendered":{"charts":0,"images":1,"macros":1,"external_links":0,"defined_names":30,"comments":0,"pivot_tables":0},"unopened":[],"bounds":{"document_bytes":16777216,"sheet_cells":100000,"rows_first":2000,"rows_last":500,"rows_between":2000,"halvings":0,"cell_chars":16384,"cell_head_chars":4096},"cells_cut":0,"cells_raw":0,"read":"whole","date_system":"1900"}

{"sheet":"Info","index":0,"n_rows":0,"n_cols":0,"rows_kept":0,"cut":false,"hidden":false,"merged":[]}

{"sheet":"Trial","index":1,"n_rows":0,"n_cols":0,"rows_kept":0,"cut":false,"hidden":true,"merged":[]}

{"sheet":"Instructions","index":2,"n_rows":589,"n_cols":1,"rows_kept":589,"cut":false,"hidden":true,"merged":[]}
["Excel Skills UK | Financial Statements Template"]
["Instructions"]
["www.excel-skills.co.uk"]
[]
["This template enables users to compile comprehensive financial statements in accordance with International Financial Reporting Standards for Small & Medium Enterprises (IFRS for SME's) based on any trial balance regardless of the account structure. The financial statements are compiled by linking each account in the trial balance to a pre-defined financial statement reporting class and all the amounts that are included on the financial statements are automatically calculated based on the linked reporting classes. The template also facilitates including financial information which is not derived from a trial balance and can easily be rolled forward or back by simply changing the reporting year in a single input cell."]
[]
["Disclaimer: The aim of this template is to assist users in compiling a standard set of annual financial statements and we can therefore not guarantee that all the annual financial statement disclosures that are required for the particular business will be accommodated in the template design. The user therefore remains solely responsible for ensuring the accuracy and completeness of financial statement disclosure."]
[]
["Note: The standard template has been designed for companies but you can use the same functionality for other entity types by saving a separate version of the template and changing the financial statement terminology to suit the required entity type."]
[]
["The template includes the following sheets:"]
["Setup - enter your business name, add a currency symbol and specify the financial year-end month and the reporting year. The reporting year that is specified determines which annual periods will be included in the current and comparative periods on the financial statements."]
["Classes - this sheet contains all the pre-defined financial statement reporting classes that should be used to link the accounts on the trial balance to the calculations on the financial statements. The class descriptions that are included on this sheet are displayed on the financial statements and the sheet also includes error checking in the columns with light blue column headings which highlights errors in the linking of the reporting classes."]
["TB - a complete trial balance for each annual period should be included on this sheet and each account in the trial balance should be linked to the appropriate financial statement reporting class by entering or copying the class code into column B. The amounts that are included on the financial statements are automatically updated based on the classes that are specified on this sheet."]
["FinInfo - this sheet contains financial statement information that is incorporated in the financial statements but not derived from the trial balance. Users are therefore required to enter the appropriate values for each annual period that is included in the template. The values that are specified on this sheet are automatically included on the financial statements based on the pre-defined code that is included in column B."]
["AFS - this sheet includes a complete set of financial statements which is automatically compiled based on the reporting year that is selected on the Setup sheet, the account balances that are included on the TB sheet and the financial information that is included on the FinInfo sheet. The reporting class codes that are used to populate each line item are included in column A."]
["TBImport - the calculations on this sheet enables users to review the sequence of trial balance accounts before copying the account balances to the TB sheet. The sequence of accounts can be amended until no errors are reflected and the calculations in column E round all trial balance amounts to the nearest integer value thereby ensuring that all the totals on the annual financial statements are accurate."]
[]
["In order to start using the template, you basically need to complete the following steps:"]
["■ Change the default settings in the cells with yellow cell backgrounds on the Setup sheet."]
{"$rows_left_out":570}
{"sheet":"Setup","index":3,"n_rows":29,"n_cols":6,"rows_kept":29,"cut":false,"hidden":true,"merged":[[11,1,11,2],[3,1,3,3]]}
[{"$f":"IF(ISBLANK($B$4),\"Example (Pty) Limited\",$B$4)","v":"Example Limited"}]
["Set-up"]
["© www.excel-skills.co.uk"]
["Business Name","Example Limited"]
[]
["Currency Symbol","£",{"$f":"IF(ISBLANK($B$6)=TRUE,\"CU\",$B$6)","v":"£"}]
[]
["Year End Month","2021-03-01"]
[]
["Reporting Year",2022]
[null,null,null,"First Day","Last Day","Last Day Text"]
["Year End Reporting Date",{"$f":"IF(ISBLANK($B$10),IF(ISBLANK($B$8),DATE(YEAR(TODAY()),MONTH(TODAY())+1,0),DATE(YEAR(TODAY()),MONTH($B$8)+1,0)),IF(ISBLANK($B$8),DATE($B$10,MONTH(TODAY())+1,0),DATE($B$10,MONTH($B$8)+1,0)))","v":"2022-03-31"},null,{"$f":"DATE(YEAR($B$12)-1,MONTH($B$12)+1,1)","v":"2021-04-01"},{"$f":"DATE(YEAR(Setup!$B$12),MONTH(Setup!$B$12)+1,0)","v":"2022-03-31"},{"$f":"TEXT($E$12,\"dd mmmm yyyy\")","v":"31 March 2022"}]
[]
["Total Number of Pages",18]
[]
["Date of Approval",null,{"$f":"IF(ISBLANK($B$16),DATE(YEAR($B$12),MONTH($B$12)+3,0),$B$16)","v":"2022-05-31"}]
[]
[null,{"$f":"DATE(YEAR(TODAY()),1,1)","v":"2022-01-01"}]
[null,{"$f":"DATE(YEAR(TODAY()),2,1)","v":"2022-02-01"}]
[null,{"$f":"DATE(YEAR(TODAY()),3,1)","v":"2022-03-01"}]
{"$rows_left_out":10}
{"sheet":"Classes","index":4,"n_rows":101,"n_cols":6,"rows_kept":101,"cut":false,"hidden":true,"merged":[]}
[{"$f":"IF(ISBLANK(Setup!$B$4),\"Example (Pty) Limited\",Setup!$B$4)","v":"Example Limited"}]
["Financial Statement Reporting Classes"]
["© www.excel-skills.co.uk"]
["Class","Description","Code Status","TB Status","AFS Status","Error Status"]
["Income Statement"]
["I-01G","Turnover",{"$f":"IF(OR(LEFT($A6,1)=\"I\",LEFT($A6,1)=\"B\")=FALSE,\"error!\",IF(RIGHT($A6,1)<>\"G\",\"error!\",\"ok\"))","v":"ok"},{"$f":"IF(ISNA(VLOOKUP($A6,TBData,COLUMN(TB!$B$4),0)),\"-\",\"ok\")","v":"-"},{"$f":"IF(ISNA(VLOOKUP($A6,AFSClass,1,0)),\"-\",\"ok\")","v":"-"},{"$f":"IF(AND(D6=\"ok\",E6<>\"ok\"),\"add!\",\"ok\")","v":"ok"}]
["I-0101G","Sales - fruit juice","ok",{"$f":"IF(ISNA(VLOOKUP($A7,TBData,COLUMN(TB!$B$4),0)),\"-\",\"ok\")","v":"ok"},"ok",{"$f":"IF(AND(D7=\"ok\",E7<>\"ok\"),\"add!\",\"ok\")","v":"ok"}]
["I-0102G","Sales - vegetable juice","ok",{"$f":"IF(ISNA(VLOOKUP($A8,TBData,COLUMN(TB!$B$4),0)),\"-\",\"ok\")","v":"ok"},"ok","ok"]
["I-02G","Cost of sales","ok",{"$f":"IF(ISNA(VLOOKUP($A9,TBData,COLUMN(TB!$B$4),0)),\"-\",\"ok\")","v":"ok"},"ok","ok"]
["I-03G","Operating expenses","ok",{"$f":"IF(ISNA(VLOOKUP($A10,TBData,COLUMN(TB!$B$4),0)),\"-\",\"ok\")","v":"-"},"-","ok"]
["I-0301G","Accounting fees","ok",{"$f":"IF(ISNA(VLOOKUP($A11,TBData,COLUMN(TB!$B$4),0)),\"-\",\"ok\")","v":"ok"},"ok","ok"]
["I-0302G","Advertising & marketing","ok",{"$f":"IF(ISNA(VLOOKUP($A12,TBData,COLUMN(TB!$B$4),0)),\"-\",\"ok\")","v":"ok"},"ok","ok"]
["I-0303G","Bank charges","ok",{"$f":"IF(ISNA(VLOOKUP($A13,TBData,COLUMN(TB!$B$4),0)),\"-\",\"ok\")","v":"ok"},"ok","ok"]
["I-0304G","Commission","ok",{"$f":"IF(ISNA(VLOOKUP($A14,TBData,COLUMN(TB!$B$4),0)),\"-\",\"ok\")","v":"ok"},"ok","ok"]
["I-0305G","Computer expenses","ok",{"$f":"IF(ISNA(VLOOKUP($A15,TBData,COLUMN(TB!$B$4),0)),\"-\",\"ok\")","v":"ok"},"ok","ok"]
["I-0306G","Consumables & cleaning","ok",{"$f":"IF(ISNA(VLOOKUP($A16,TBData,COLUMN(TB!$B$4),0)),\"-\",\"ok\")","v":"ok"},"ok","ok"]
["I-0307G","Entertainment","ok",{"$f":"IF(ISNA(VLOOKUP($A17,TBData,COLUMN(TB!$B$4),0)),\"-\",\"ok\")","v":"ok"},"ok","ok"]
["I-0308G","Insurance","ok",{"$f":"IF(ISNA(VLOOKUP($A18,TBData,COLUMN(TB!$B$4),0)),\"-\",\"ok\")","v":"ok"},"ok","ok"]
["I-0309G","Office expenses","ok",{"$f":"IF(ISNA(VLOOKUP($A19,TBData,COLUMN(TB!$B$4),0)),\"-\",\"ok\")","v":"ok"},"ok","ok"]
["I-0310G","Office rent","ok",{"$f":"IF(ISNA(VLOOKUP($A20,TBData,COLUMN(TB!$B$4),0)),\"-\",\"ok\")","v":"ok"},"ok","ok"]
{"$rows_left_out":82}
{"sheet":"TB","index":5,"n_rows":92,"n_cols":12,"rows_kept":92,"cut":false,"hidden":true,"merged":[]}
[{"$f":"IF(ISBLANK(Setup!$B$4),\"Example (Pty) Limited\",Setup!$B$4)","v":"Example Limited"}]
["Trial Balance"]
["© www.excel-skills.co.uk",null,null,null,{"$f":"SUBTOTAL(9,OFFSET(E$4,1,0,TBRowCount,1))","v":0},{"$f":"SUBTOTAL(9,OFFSET(F$4,1,0,TBRowCount,1))","v":0},{"$f":"SUBTOTAL(9,OFFSET(G$4,1,0,TBRowCount,1))","v":0},{"$f":"SUBTOTAL(9,OFFSET(H$4,1,0,TBRowCount,1))","v":0},{"$f":"SUBTOTAL(9,OFFSET(I$4,1,0,TBRowCount,1))","v":0},{"$f":"SUBTOTAL(9,OFFSET(J$4,1,0,TBRowCount,1))","v":0},{"$f":"SUBTOTAL(9,OFFSET(K$4,1,0,TBRowCount,1))","v":0},{"$f":"SUBTOTAL(9,OFFSET(L$4,1,0,TBRowCount,1))","v":0}]
["Status","Class","Acc No","Account Description",2020,2021,2022,2023,2024,2025,2026,2027]
[{"$f":"IF(ISNA(VLOOKUP($B5,ClassCode,1,0)),\"class!\",IF(ISNA(VLOOKUP($B5,AFSClass,1,0)),\"add!\",\"ok\"))","v":"ok"},"B-0001G","BS-0005","Land & Buildings - Cost",2500000,2500000,2400000,0,0,0,0,0]
["ok","B-0002G","BS-0010","Plant & Equipment - Cost",1246045,1316045,1546045,0,0,0,0,0]
["ok","B-0003G","BS-0015","Furniture & Fittings - Cost",300000,350000,410000,0,0,0,0,0]
["ok","B-0004G","BS-0020","Office Equipment - Cost",225000,240000,240000,0,0,0,0,0]
["ok","B-0005G","BS-0025","Computer Equipment - Cost",120750,150500,165500,0,0,0,0,0]
["ok","B-0006G","BS-0030","Motor Vehicles - Cost",318000,318000,452000,0,0,0,0,0]
["ok","B-0101G","BS-0105","Land & Buildings - Accum Depreciation",0,0,0,0,0,0,0,0]
["ok","B-0102G","BS-0110","Plant & Equipment - Accum Depreciation",-498418,-712418,-1051018,0,0,0,0,0]
["ok","B-0103G","BS-0115","Furniture & Fittings - Accum Depreciation",-100000,-158300,-224700,0,0,0,0,0]
["ok","B-0104G","BS-0120","Office Equipment -  Accum Depreciation",-91500,-139850,-186980,0,0,0,0,0]
["ok","B-0105G","BS-0125","Computer Equipment -  Accum Depreciation",-80500,-130650,-145550,0,0,0,0,0]
["ok","B-0106G","BS-0130","Motor Vehicles -  Accum Depreciation",-159000,-238500,-56500,0,0,0,0,0]
["ok","B-0201G","BS-0205","Goodwill - Cost",500000,500000,500000,0,0,0,0,0]
["ok","B-0202G","BS-0210","Trademarks - Cost",390500,390500,390500,0,0,0,0,0]
["ok","B-0203G","BS-0215","Software - Cost",150000,150000,150000,0,0,0,0,0]
["ok","B-0301G","BS-0305","Goodwill - Accum Amortization",-100000,-150000,-200000,0,0,0,0,0]
{"$rows_left_out":73}
{"sheet":"FinInfo","index":6,"n_rows":97,"n_cols":11,"rows_kept":97,"cut":false,"hidden":true,"merged":[]}
[{"$f":"IF(ISBLANK(Setup!$B$4),\"Example (Pty) Limited\",Setup!$B$4)","v":"Example Limited"}]
["Financial Statement Information (orange classes require negative values)"]
["© www.excel-skills.co.uk"]
["Status","Class","Description",2020,2021,2022,2023,2024,2025,2026,2027]
[null,"Items with descriptions that are based on specific TB reporting classes (as per Classes sheet or this sheet)"]
[{"$f":"IF(ISNA(VLOOKUP(\"B\"&MID($B6,2,LEN($B6)-2)&\"G\",ClassAll,COLUMN(Classes!$B$4),0)),\"error!\",\"ok\")","v":"ok"},"F-0001R",{"$f":"\"Depreciation Rate - \"&IF(ISNA(VLOOKUP(\"B\"&MID($B6,2,LEN($B6)-2)&\"G\",ClassAll,COLUMN(Classes!$B$4),0)),\"PPE Class\",VLOOKUP(\"B\"&MID($B6,2,LEN($B6)-2)&\"G\",ClassAll,COLUMN(Classes!$B$4),0))","v":"Depreciation Rate - Land & buildings"},0,0,0,0,0,0,0,0]
[{"$f":"IF(ISNA(VLOOKUP(\"B\"&MID($B7,2,LEN($B7)-2)&\"G\",ClassAll,COLUMN(Classes!$B$4),0)),\"error!\",\"ok\")","v":"ok"},"F-0002R",{"$f":"\"Depreciation Rate - \"&IF(ISNA(VLOOKUP(\"B\"&MID($B7,2,LEN($B7)-2)&\"G\",ClassAll,COLUMN(Classes!$B$4),0)),\"PPE Class\",VLOOKUP(\"B\"&MID($B7,2,LEN($B7)-2)&\"G\",ClassAll,COLUMN(Classes!$B$4),0))","v":"Depreciation Rate - Plant & equipment"},0.2,0.2,0.2,0.2,0.2,0.2,0.2,0.2]
[{"$f":"IF(ISNA(VLOOKUP(\"B\"&MID($B8,2,LEN($B8)-2)&\"G\",ClassAll,COLUMN(Classes!$B$4),0)),\"error!\",\"ok\")","v":"ok"},"F-0003R",{"$f":"\"Depreciation Rate - \"&IF(ISNA(VLOOKUP(\"B\"&MID($B8,2,LEN($B8)-2)&\"G\",ClassAll,COLUMN(Classes!$B$4),0)),\"PPE Class\",VLOOKUP(\"B\"&MID($B8,2,LEN($B8)-2)&\"G\",ClassAll,COLUMN(Classes!$B$4),0))","v":"Depreciation Rate - Furniture & fittings"},0.16700000000000001,0.16700000000000001,0.16700000000000001,0.16700000000000001,0.16700000000000001,0.16700000000000001,0.16700000000000001,0.16700000000000001]
[{"$f":"IF(ISNA(VLOOKUP(\"B\"&MID($B9,2,LEN($B9)-2)&\"G\",ClassAll,COLUMN(Classes!$B$4),0)),\"error!\",\"ok\")","v":"ok"},"F-0004R",{"$f":"\"Depreciation Rate - \"&IF(ISNA(VLOOKUP(\"B\"&MID($B9,2,LEN($B9)-2)&\"G\",ClassAll,COLUMN(Classes!$B$4),0)),\"PPE Class\",VLOOKUP(\"B\"&MID($B9,2,LEN($B9)-2)&\"G\",ClassAll,COLUMN(Classes!$B$4),0))","v":"Depreciation Rate - Office equipment"},0.2,0.2,0.2,0.2,0.2,0.2,0.2,0.2]
[{"$f":"IF(ISNA(VLOOKUP(\"B\"&MID($B10,2,LEN($B10)-2)&\"G\",ClassAll,COLUMN(Classes!$B$4),0)),\"error!\",\"ok\")","v":"ok"},"F-0005R",{"$f":"\"Depreciation Rate - \"&IF(ISNA(VLOOKUP(\"B\"&MID($B10,2,LEN($B10)-2)&\"G\",ClassAll,COLUMN(Classes!$B$4),0)),\"PPE Class\",VLOOKUP(\"B\"&MID($B10,2,LEN($B10)-2)&\"G\",ClassAll,COLUMN(Classes!$B$4),0))","v":"Depreciation Rate - Computer equipment"},0.33300000000000002,0.33300000000000002,0.33300000000000002,0.33300000000000002,0.33300000000000002,0.33300000000000002,0.33300000000000002,0.33300000000000002]
[{"$f":"IF(ISNA(VLOOKUP(\"B\"&MID($B11,2,LEN($B11)-2)&\"G\",ClassAll,COLUMN(Classes!$B$4),0)),\"error!\",\"ok\")","v":"ok"},"F-0006R",{"$f":"\"Depreciation Rate - \"&IF(ISNA(VLOOKUP(\"B\"&MID($B11,2,LEN($B11)-2)&\"G\",ClassAll,COLUMN(Classes!$B$4),0)),\"PPE Class\",VLOOKUP(\"B\"&MID($B11,2,LEN($B11)-2)&\"G\",ClassAll,COLUMN(Classes!$B$4),0))","v":"Depreciation Rate - Motor vehicles"},0.25,0.25,0.25,0.25,0.25,0.25,0.25,0.25]
[{"$f":"IF(ISNA(VLOOKUP(\"B\"&MID($B12,2,LEN($B12)-2)&\"G\",ClassAll,COLUMN(Classes!$B$4),0)),\"error!\",\"ok\")","v":"ok"},"F-0001D",{"$f":"\"Disposals - Cost - \"&IF(ISNA(VLOOKUP(\"B\"&MID($B12,2,LEN($B12)-2)&\"G\",ClassAll,COLUMN(Classes!$B$4),0)),\"PPE Class\",VLOOKUP(\"B\"&MID($B12,2,LEN($B12)-2)&\"G\",ClassAll,COLUMN(Classes!$B$4),0))","v":"Disposals - Cost - Land & buildings"},0,0,0,0,0,0,0,0]
[{"$f":"IF(ISNA(VLOOKUP(\"B\"&MID($B13,2,LEN($B13)-2)&\"G\",ClassAll,COLUMN(Classes!$B$4),0)),\"error!\",\"ok\")","v":"ok"},"F-0002D",{"$f":"\"Disposals - Cost - \"&IF(ISNA(VLOOKUP(\"B\"&MID($B13,2,LEN($B13)-2)&\"G\",ClassAll,COLUMN(Classes!$B$4),0)),\"PPE Class\",VLOOKUP(\"B\"&MID($B13,2,LEN($B13)-2)&\"G\",ClassAll,COLUMN(Classes!$B$4),0))","v":"Disposals - Cost - Plant & equipment"},0,-110000,0,0,0,0,0,0]
[{"$f":"IF(ISNA(VLOOKUP(\"B\"&MID($B14,2,LEN($B14)-2)&\"G\",ClassAll,COLUMN(Classes!$B$4),0)),\"error!\",\"ok\")","v":"ok"},"F-0003D",{"$f":"\"Disposals - Cost - \"&IF(ISNA(VLOOKUP(\"B\"&MID($B14,2,LEN($B14)-2)&\"G\",ClassAll,COLUMN(Classes!$B$4),0)),\"PPE Class\",VLOOKUP(\"B\"&MID($B14,2,LEN($B14)-2)&\"G\",ClassAll,COLUMN(Classes!$B$4),0))","v":"Disposals - Cost - Furniture & fittings"},0,0,0,0,0,0,0,0]
[{"$f":"IF(ISNA(VLOOKUP(\"B\"&MID($B15,2,LEN($B15)-2)&\"G\",ClassAll,COLUMN(Classes!$B$4),0)),\"error!\",\"ok\")","v":"ok"},"F-0004D",{"$f":"\"Disposals - Cost - \"&IF(ISNA(VLOOKUP(\"B\"&MID($B15,2,LEN($B15)-2)&\"G\",ClassAll,COLUMN(Classes!$B$4),0)),\"PPE Class\",VLOOKUP(\"B\"&MID($B15,2,LEN($B15)-2)&\"G\",ClassAll,COLUMN(Classes!$B$4),0))","v":"Disposals - Cost - Office equipment"},0,0,0,0,0,0,0,0]
[{"$f":"IF(ISNA(VLOOKUP(\"B\"&MID($B16,2,LEN($B16)-2)&\"G\",ClassAll,COLUMN(Classes!$B$4),0)),\"error!\",\"ok\")","v":"ok"},"F-0005D",{"$f":"\"Disposals - Cost - \"&IF(ISNA(VLOOKUP(\"B\"&MID($B16,2,LEN($B16)-2)&\"G\",ClassAll,COLUMN(Classes!$B$4),0)),\"PPE Class\",VLOOKUP(\"B\"&MID($B16,2,LEN($B16)-2)&\"G\",ClassAll,COLUMN(Classes!$B$4),0))","v":"Disposals - Cost - Computer equipment"},0,0,0,0,0,0,0,0]
[{"$f":"IF(ISNA(VLOOKUP(\"B\"&MID($B17,2,LEN($B17)-2)&\"G\",ClassAll,COLUMN(Classes!$B$4),0)),\"error!\",\"ok\")","v":"ok"},"F-0006D",{"$f":"\"Disposals - Cost - \"&IF(ISNA(VLOOKUP(\"B\"&MID($B17,2,LEN($B17)-2)&\"G\",ClassAll,COLUMN(Classes!$B$4),0)),\"PPE Class\",VLOOKUP(\"B\"&MID($B17,2,LEN($B17)-2)&\"G\",ClassAll,COLUMN(Classes!$B$4),0))","v":"Disposals - Cost - Motor vehicles"},0,0,-318000,0,0,0,0,0]
[{"$f":"IF(ISNA(VLOOKUP(\"B\"&MID($B18,2,LEN($B18)-2)&\"G\",ClassAll,COLUMN(Classes!$B$4),0)),\"error!\",\"ok\")","v":"ok"},"F-0001I",{"$f":"\"Impairment - Cost - \"&IF(ISNA(VLOOKUP(\"B\"&MID($B18,2,LEN($B18)-2)&\"G\",ClassAll,COLUMN(Classes!$B$4),0)),\"PPE Class\",VLOOKUP(\"B\"&MID($B18,2,LEN($B18)-2)&\"G\",ClassAll,COLUMN(Classes!$B$4),0))","v":"Impairment - Cost - Land & buildings"},0,0,-100000,0,0,0,0,0]
[{"$f":"IF(ISNA(VLOOKUP(\"B\"&MID($B19,2,LEN($B19)-2)&\"G\",ClassAll,COLUMN(Classes!$B$4),0)),\"error!\",\"ok\")","v":"ok"},"F-0002I",{"$f":"\"Impairment - Cost - \"&IF(ISNA(VLOOKUP(\"B\"&MID($B19,2,LEN($B19)-2)&\"G\",ClassAll,COLUMN(Classes!$B$4),0)),\"PPE Class\",VLOOKUP(\"B\"&MID($B19,2,LEN($B19)-2)&\"G\",ClassAll,COLUMN(Classes!$B$4),0))","v":"Impairment - Cost - Plant & equipment"},0,0,0,0,0,0,0,0]
[{"$f":"IF(ISNA(VLOOKUP(\"B\"&MID($B20,2,LEN($B20)-2)&\"G\",ClassAll,COLUMN(Classes!$B$4),0)),\"error!\",\"ok\")","v":"ok"},"F-0003I",{"$f":"\"Impairment - Cost - \"&IF(ISNA(VLOOKUP(\"B\"&MID($B20,2,LEN($B20)-2)&\"G\",ClassAll,COLUMN(Classes!$B$4),0)),\"PPE Class\",VLOOKUP(\"B\"&MID($B20,2,LEN($B20)-2)&\"G\",ClassAll,COLUMN(Classes!$B$4),0))","v":"Impairment - Cost - Furniture & fittings"},0,0,0,0,0,0,0,0]
{"$rows_left_out":78}
{"sheet":"AFS","index":7,"n_rows":704,"n_cols":16,"rows_kept":704,"cut":false,"hidden":true,"merged":[[4,1,4,9],[5,1,5,9],[10,1,10,9],[336,1,336,9],[330,1,330,9],[334,1,334,9],[139,1,139,9],[101,1,101,9],[122,1,122,9],[475,1,475,9],[118,1,118,9],[120,1,120,9],[124,1,124,9],[9,1,9,9],[395,1,395,9],[383,1,383,9],[375,1,375,9],[133,1,133,9],[145,1,145,9],[137,1,137,9],[149,1,149,9],[379,1,379,9],[95,1,95,9],[97,1,97,9],[99,1,99,9],[348,1,348,9],[350,1,350,9],[359,1,359,9],[332,1,332,9],[135,1,135,9],[147,1,147,9],[151,1,151,9],[143,1,143,9],[141,1,141,9],[338,1,338,9],[340,1,340,9],[342,1,342,9],[344,1,344,9],[346,1,346,9],[365,1,365,9],[367,1,367,9],[377,1,377,9],[397,1,397,9],[399,1,399,9],[381,1,381,9],[385,1,385,9],[387,1,387,9],[389,1,389,9],[373,1,373,9],[703,1,703,9],[600,1,600,9],[607,1,607,9],[614,1,614,9],[632,1,632,9],[652,1,652,9],[657,1,657,9],[691,1,691,9],[695,1,695,9],[687,1,687,9],[513,1,513,9],[515,1,515,9],[540,1,540,9],[565,1,565,9],[567,1,567,9],[419,1,419,9],[421,1,421,9],[423,1,423,9],[425,1,425,9],[401,1,401,9],[403,1,403,9],[405,1,405,9],[415,1,415,9],[417,1,417,9],[407,1,407,9],[409,1,409,9],[411,1,411,9],[413,1,413,9]]}
[null,null,null,null,null,null,null,null,null,null,"NOTE: Print area is only from column B to J."]
[]
[]
[]
[null,{"$f":"Setup!$A$1","v":"Example Limited"}]
[null,{"$f":"\"(Registration Number: \"&IF(ISBLANK($E$88),\"0000 000000 00\",$E$88)&\")\"","v":"(Registration Number: 07000000)"}]
[]
[]
[]
[null,"Financial statements"]
[null,{"$f":"\"for the year ended \"&Setup!$F$12","v":"for the year ended 31 March 2022"}]
[]
[]
[]
[]
[]
[]
[]
[]
[]
{"$rows_left_out":685}
{"sheet":"TBImport","index":8,"n_rows":92,"n_cols":6,"rows_kept":92,"cut":false,"hidden":true,"merged":[]}
[{"$f":"IF(ISBLANK(Setup!$B$4),\"Example (Pty) Limited\",Setup!$B$4)","v":"Example Limited"}]
["Trial Balance Sequence & Rounding"]
["© www.excel-skills.co.uk",null,null,null,{"$f":"SUBTOTAL(9,OFFSET($E$4,1,0,1000,1))","v":0},{"$f":"IF(E3<>0,\"Error! Rounded TB values in column E do not balance.\",\"ok\")","v":"ok"}]
["Acc No","Account Description","Amount","Check","Amount"]
["BS-0005","Land & Buildings - Cost",2400000,{"$f":"IF(OFFSET(TB!$C$4,ROW($A5)-ROW($A$4),0,1,1)=$A5,\"ok\",\"error!\")","v":"ok"},{"$f":"ROUND(C5,0)","v":2400000}]
["BS-0010","Plant & Equipment - Cost",1546045,{"$f":"IF(OFFSET(TB!$C$4,ROW($A6)-ROW($A$4),0,1,1)=$A6,\"ok\",\"error!\")","v":"ok"},{"$f":"ROUND(C6,0)","v":1546045}]
["BS-0015","Furniture & Fittings - Cost",410000,{"$f":"IF(OFFSET(TB!$C$4,ROW($A7)-ROW($A$4),0,1,1)=$A7,\"ok\",\"error!\")","v":"ok"},410000]
["BS-0020","Office Equipment - Cost",240000,{"$f":"IF(OFFSET(TB!$C$4,ROW($A8)-ROW($A$4),0,1,1)=$A8,\"ok\",\"error!\")","v":"ok"},240000]
["BS-0025","Computer Equipment - Cost",165500,{"$f":"IF(OFFSET(TB!$C$4,ROW($A9)-ROW($A$4),0,1,1)=$A9,\"ok\",\"error!\")","v":"ok"},165500]
["BS-0030","Motor Vehicles - Cost",452000,{"$f":"IF(OFFSET(TB!$C$4,ROW($A10)-ROW($A$4),0,1,1)=$A10,\"ok\",\"error!\")","v":"ok"},452000]
["BS-0105","Land & Buildings - Accum Depreciation",0,{"$f":"IF(OFFSET(TB!$C$4,ROW($A11)-ROW($A$4),0,1,1)=$A11,\"ok\",\"error!\")","v":"ok"},0]
["BS-0110","Plant & Equipment - Accum Depreciation",-1051018,{"$f":"IF(OFFSET(TB!$C$4,ROW($A12)-ROW($A$4),0,1,1)=$A12,\"ok\",\"error!\")","v":"ok"},-1051018]
["BS-0115","Furniture & Fittings - Accum Depreciation",-224700,{"$f":"IF(OFFSET(TB!$C$4,ROW($A13)-ROW($A$4),0,1,1)=$A13,\"ok\",\"error!\")","v":"ok"},-224700]
["BS-0120","Office Equipment -  Accum Depreciation",-186980,{"$f":"IF(OFFSET(TB!$C$4,ROW($A14)-ROW($A$4),0,1,1)=$A14,\"ok\",\"error!\")","v":"ok"},-186980]
["BS-0125","Computer Equipment -  Accum Depreciation",-145550,{"$f":"IF(OFFSET(TB!$C$4,ROW($A15)-ROW($A$4),0,1,1)=$A15,\"ok\",\"error!\")","v":"ok"},-145550]
["BS-0130","Motor Vehicles -  Accum Depreciation",-56500,{"$f":"IF(OFFSET(TB!$C$4,ROW($A16)-ROW($A$4),0,1,1)=$A16,\"ok\",\"error!\")","v":"ok"},-56500]
["BS-0205","Goodwill - Cost",500000,{"$f":"IF(OFFSET(TB!$C$4,ROW($A17)-ROW($A$4),0,1,1)=$A17,\"ok\",\"error!\")","v":"ok"},500000]
["BS-0210","Trademarks - Cost",390500,{"$f":"IF(OFFSET(TB!$C$4,ROW($A18)-ROW($A$4),0,1,1)=$A18,\"ok\",\"error!\")","v":"ok"},390500]
["BS-0215","Software - Cost",150000,{"$f":"IF(OFFSET(TB!$C$4,ROW($A19)-ROW($A$4),0,1,1)=$A19,\"ok\",\"error!\")","v":"ok"},150000]
["BS-0305","Goodwill - Accum Amortization",-200000,{"$f":"IF(OFFSET(TB!$C$4,ROW($A20)-ROW($A$4),0,1,1)=$A20,\"ok\",\"error!\")","v":"ok"},-200000]
{"$rows_left_out":72}