{"text_format":"1","workbook":"xlsx","n_sheets":15,"sheets":["Info","Trial","Instructions","Setup","Suppliers","StockCode","Details","PO","Remittance","Statement","Monthly","Ageing","Balances","Forecast","ChartInfo"],"not_rendered":{"charts":5,"images":1,"macros":1,"external_links":0,"defined_names":46,"comments":0,"pivot_tables":0},"unopened":[],"bounds":{"document_bytes":16777216,"sheet_cells":100000,"rows_first":2000,"rows_last":500,"rows_between":2000,"halvings":0,"cell_chars":16384,"cell_head_chars":4096},"cells_cut":0,"cells_raw":0,"read":"whole","date_system":"1900"}

{"sheet":"Info","index":0,"n_rows":0,"n_cols":0,"rows_kept":0,"cut":false,"hidden":false,"merged":[]}

{"sheet":"Trial","index":1,"n_rows":0,"n_cols":0,"rows_kept":0,"cut":false,"hidden":true,"merged":[]}

{"sheet":"Instructions","index":2,"n_rows":237,"n_cols":1,"rows_kept":237,"cut":false,"hidden":true,"merged":[]}
["Excel Skills UK | Purchase Order & Supplier Payments Template"]
["Instructions"]
["www.excel-skills.co.uk"]
[]
["This template enables users to create automated purchase orders, payment remittances & supplier account statements based on the business details, supplier information and purchase order & supplier invoice details recorded on the appropriate sheets. The template also facilitates creating automated reports including a 12 month purchase history review, age analysis for individual or all supplier accounts, supplier account balances and a supplier payment forecast. The template can be used for both stock based and service based suppliers."]
[]
{"$rows_left_out":232}
{"sheet":"Setup","index":3,"n_rows":28,"n_cols":3,"rows_kept":28,"cut":false,"hidden":true,"merged":[[27,1,27,2],[4,2,4,3],[24,1,24,2],[25,1,25,2],[26,1,26,2],[6,2,6,5]]}
[{"$f":"$C$5","v":"Example Limited"}]
["Set-up"]
["© www.excel-skills.co.uk"]
["Business Details"]
["Business Name",null,"Example Limited"]
[]
{"$rows_left_out":23}
{"sheet":"Suppliers","index":4,"n_rows":24,"n_cols":4,"rows_kept":24,"cut":false,"hidden":true,"merged":[]}
[{"$f":"Setup!$C$5","v":"Example Limited"}]
["Supplier Set-up"]
["© www.excel-skills.co.uk"]
["Code","Billing Name","Billing Address","Tax Number"]
["ABC01","ABC Limited","22 Long Street, Orange County, Los Angeles California, United States, 15120","N/A"]
["CCS01","CC Supplies","10 High Street, Acton, London, W3 6AW","499 888 200"]
{"$rows_left_out":19}
{"sheet":"StockCode","index":5,"n_rows":18,"n_cols":3,"rows_kept":18,"cut":false,"hidden":true,"merged":[]}
[{"$f":"Setup!$C$5","v":"Example Limited"}]
["Stock Code Set-up"]
["© www.excel-skills.co.uk"]
["Code","Description","UOM"]
["1111ZZ","Prepaid Electricity Meter","Units"]
["2222ZZ","Cables","M"]
{"$rows_left_out":13}
{"sheet":"Details","index":6,"n_rows":54,"n_cols":26,"rows_kept":54,"cut":false,"hidden":true,"merged":[]}
[{"$f":"Setup!$C$5","v":"Example Limited"}]
["Invoice Details"]
["© www.excel-skills.co.uk",null,null,null,null,null,null,null,null,null,null,null,{"$f":"SUBTOTAL(109,OrderDetails[[#Data],[Payment Amount]])","v":45350.94000000001},null,null,{"$f":"SUBTOTAL(109,OrderDetails[[#Data],[Tax Inclusive Amount]])","v":51949.420000000013},{"$f":"SUBTOTAL(109,OrderDetails[[#Data],[Sales Tax Amount]])","v":8545.4366666666683},{"$f":"SUBTOTAL(109,OrderDetails[[#Data],[Exclusive Amount]])","v":43403.983333333344},{"$f":"SUBTOTAL(109,OrderDetails[[#Data],[Invoice \nBalance]])","v":6542.08}]
["Purchase Order No","Order Date","Supplier Invoice No","Invoice Date","Supplier Code","Stock Code","Description","UOM","Quantity","Price","Tax Code","Invoice Due Date","Payment Amount","Payment Date","Remittance Number","Tax Inclusive Amount","Sales Tax Amount","Exclusive Amount","Invoice \nBalance","ID1","PO1","SC1","Invoice Ref","Remit Ref","RM1","Error Code"]
["PO-0001","2020-04-01","CCS5715","2020-04-15","CCS01","1111ZZ",{"$f":"IF(ISNA(VLOOKUP($F5,StockCodeAll,COLUMN(StockCode!$B$4),0)),\"-\",VLOOKUP($F5,StockCodeAll,COLUMN(StockCode!$B$4),0))","v":"Prepaid Electricity Meter"},{"$f":"IF(ISNA(VLOOKUP($F5,StockCodeAll,COLUMN(StockCode!$C$4),0)),\"-\",VLOOKUP($F5,StockCodeAll,COLUMN(StockCode!$C$4),0))","v":"Units"},20,120,"A","2020-05-15",2400,"2020-05-15","PMT-100001",{"$f":"I5*J5","v":2400},{"$f":"$P5/(1+IF(ISERROR($K5),0,IF(ISNA(MATCH($K5,TaxCode,0)),0,OFFSET(Setup!$B$17,MATCH($K5,TaxCode,0),0,1,1))))*IF(ISERROR($K5),0,IF(ISNA(MATCH($K5,TaxCode,0)),0,OFFSET(Setup!$B$17,MATCH($K5,TaxCode,0),0,1,1)))","v":400},{"$f":"$P5-$Q5","v":2000},{"$f":"IF($T5=1,SUMIFS(InvoiceAmount,Invoice_Number,$C5,InvoiceSupp,$E5)-SUMIFS(PaymentAmount,Invoice_Number,$C5,InvoiceSupp,$E5),0)","v":0},{"$f":"IF(COUNTIF(OFFSET($W$4,1,0,ROW($W5)-ROW($W$4),1),$E5&\"-\"&$C5)=1,1,0)","v":1},{"$f":"IF(AND($A5=PO!$H$11,$I5<>0,ISBLANK($I5)=FALSE,$E5=PO!$C$12),1,0)","v":0},{"$f":"IF(AND($E5=Statement!$J$11,SUMIFS(InvoiceAmount,Invoice_Number,$C5,InvoiceDate,\"<=\"&Statement!$J$12)-SUMIFS(PaymentAmount,Invoice_Number,$C5,PayDate,\"<=\"&Statement!$J$12)<>0,$T5=1),1,0)","v":0},{"$f":"IF(ISBLANK(C5)=FALSE,E5&\"-\"&C5,\"-\")","v":"CCS01-CCS5715"},{"$f":"IF(ISBLANK(C5)=FALSE,E5&\"-\"&C5&\"-\"&O5,\"-\")","v":"CCS01-CCS5715-PMT-100001"},{"$f":"IF(AND($O5=Remittance!$J$10,$E5=Remittance!$J$11,COUNTIF(OFFSET($X$4,1,0,ROW($X5)-ROW($X$4),1),$E5&\"-\"&$C5&\"-\"&O5)=1),1,0)","v":0},{"$f":"IF(AND($N5<$D5,ISBLANK($N5)=FALSE)=TRUE,\"E1\",IF(AND(ISNA(VLOOKUP($E5,SuppCode,1,0)),ISBLANK($E5)=FALSE),\"E2\",IF(AND(ISBLANK(N5)=FALSE,ISBLANK(C5)=TRUE)=TRUE,\"E3\",IF(AND(ISNA(VLOOKUP($F5,StockCode,1,0)),ISBLANK($F5)=FALSE),\"E4\",\"-\"))))","v":"-"}]
["PO-0001","2020-04-01","CCS5715","2020-04-15","CCS01","2222ZZ",{"$f":"IF(ISNA(VLOOKUP($F6,StockCodeAll,COLUMN(StockCode!$B$4),0)),\"-\",VLOOKUP($F6,StockCodeAll,COLUMN(StockCode!$B$4),0))","v":"Cables"},{"$f":"IF(ISNA(VLOOKUP($F6,StockCodeAll,COLUMN(StockCode!$C$4),0)),\"-\",VLOOKUP($F6,StockCodeAll,COLUMN(StockCode!$C$4),0))","v":"M"},90,7.92,"A","2020-05-15",712.8,"2020-05-15","PMT-100001",712.8,{"$f":"$P6/(1+IF(ISERROR($K6),0,IF(ISNA(MATCH($K6,TaxCode,0)),0,OFFSET(Setup!$B$17,MATCH($K6,TaxCode,0),0,1,1))))*IF(ISERROR($K6),0,IF(ISNA(MATCH($K6,TaxCode,0)),0,OFFSET(Setup!$B$17,MATCH($K6,TaxCode,0),0,1,1)))","v":118.80000000000001},594,{"$f":"IF($T6=1,SUMIFS(InvoiceAmount,Invoice_Number,$C6,InvoiceSupp,$E6)-SUMIFS(PaymentAmount,Invoice_Number,$C6,InvoiceSupp,$E6),0)","v":0},0,{"$f":"IF(AND($A6=PO!$H$11,$I6<>0,ISBLANK($I6)=FALSE,$E6=PO!$C$12),1,0)","v":0},{"$f":"IF(AND($E6=Statement!$J$11,SUMIFS(InvoiceAmount,Invoice_Number,$C6,InvoiceDate,\"<=\"&Statement!$J$12)-SUMIFS(PaymentAmount,Invoice_Number,$C6,PayDate,\"<=\"&Statement!$J$12)<>0,$T6=1),1,0)","v":0},"CCS01-CCS5715","CCS01-CCS5715-PMT-100001",{"$f":"IF(AND($O6=Remittance!$J$10,$E6=Remittance!$J$11,COUNTIF(OFFSET($X$4,1,0,ROW($X6)-ROW($X$4),1),$E6&\"-\"&$C6&\"-\"&O6)=1),1,0)","v":0},"-"]
{"$rows_left_out":49}
{"sheet":"PO","index":7,"n_rows":58,"n_cols":8,"rows_kept":58,"cut":false,"hidden":true,"merged":[[11,2,11,4],[12,2,12,4],[13,2,13,4]]}
[]
[]
[null,null,null,null,null,{"$f":"Setup!$C$5","v":"Example Limited"}]
[null,null,null,null,null,{"$f":"IF(ISBLANK(Setup!$C$7)=TRUE,\"\",Setup!$C$7)","v":"Building Name, Street Address, Borough, City, Code"}]
[null,null,null,null,null,{"$f":"IF(ISBLANK(Setup!$C$9)=TRUE,\"\",\"Tel: \"&Setup!$C$9)&IF(ISBLANK(Setup!$C$10)=TRUE,\"\",\"   Fax: \"&Setup!$C$10)","v":"Tel: 020 9999 9999   Fax: 020 9999 9999"}]
[null,null,null,null,null,{"$f":"IF(ISBLANK(Setup!$C$12)=TRUE,\"\",\"E-mail: \"&Setup!$C$12)&IF(ISBLANK(Setup!$C$11)=TRUE,\"\",\"   Website: \"&Setup!$C$11)","v":"E-mail: info@example.co.uk   Website: www.example.co.uk"}]
{"$rows_left_out":53}
{"sheet":"Remittance","index":8,"n_rows":53,"n_cols":11,"rows_kept":53,"cut":false,"hidden":true,"merged":[[10,2,10,5],[11,2,11,5]]}
[]
[]
[null,null,null,null,null,null,{"$f":"Setup!$C$5","v":"Example Limited"}]
[null,null,null,null,null,null,{"$f":"IF(ISBLANK(Setup!$C$7)=TRUE,\"\",Setup!$C$7)","v":"Building Name, Street Address, Borough, City, Code"}]
[null,null,null,null,null,null,{"$f":"IF(ISBLANK(Setup!$C$9)=TRUE,\"\",\"Tel: \"&Setup!$C$9)&IF(ISBLANK(Setup!$C$10)=TRUE,\"\",\"   Fax: \"&Setup!$C$10)","v":"Tel: 020 9999 9999   Fax: 020 9999 9999"}]
[null,null,null,null,null,null,{"$f":"IF(ISBLANK(Setup!$C$12)=TRUE,\"\",\"E-mail: \"&Setup!$C$12)&IF(ISBLANK(Setup!$C$11)=TRUE,\"\",\"   Website: \"&Setup!$C$11)","v":"E-mail: info@example.co.uk   Website: www.example.co.uk"}]
{"$rows_left_out":48}
{"sheet":"Statement","index":9,"n_rows":51,"n_cols":11,"rows_kept":51,"cut":false,"hidden":true,"merged":[[11,2,11,5],[12,2,12,5]]}
[]
[]
[null,null,null,null,null,null,{"$f":"Setup!$C$5","v":"Example Limited"}]
[null,null,null,null,null,null,{"$f":"IF(ISBLANK(Setup!$C$7)=TRUE,\"\",Setup!$C$7)","v":"Building Name, Street Address, Borough, City, Code"}]
[null,null,null,null,null,null,{"$f":"IF(ISBLANK(Setup!$C$9)=TRUE,\"\",\"Tel: \"&Setup!$C$9)&IF(ISBLANK(Setup!$C$10)=TRUE,\"\",\"   Fax: \"&Setup!$C$10)","v":"Tel: 020 9999 9999   Fax: 020 9999 9999"}]
[null,null,null,null,null,null,{"$f":"IF(ISBLANK(Setup!$C$12)=TRUE,\"\",\"E-mail: \"&Setup!$C$12)&IF(ISBLANK(Setup!$C$11)=TRUE,\"\",\"   Website: \"&Setup!$C$11)","v":"E-mail: info@example.co.uk   Website: www.example.co.uk"}]
{"$rows_left_out":46}
{"sheet":"Monthly","index":10,"n_rows":19,"n_cols":5,"rows_kept":19,"cut":false,"hidden":true,"merged":[]}
[{"$f":"Setup!$C$5","v":"Example Limited"}]
["Monthly Purchases"]
["© www.excel-skills.co.uk"]
["Start Date","2020-04-01"]
[]
["Date","Purchases","Payments","Creditors","P/Orders"]
{"$rows_left_out":14}
{"sheet":"Ageing","index":11,"n_rows":27,"n_cols":7,"rows_kept":27,"cut":false,"hidden":true,"merged":[[4,3,5,6]]}
[{"$f":"Setup!C5","v":"Example Limited"}]
["Creditors Age Analysis"]
["© www.excel-skills.co.uk"]
["Statement Date","2021-03-31",{"$f":"IF(ISBLANK(B4)=TRUE,\"enter date!\",\"\")","v":""},{"$f":"IF(ISBLANK($B$6)=TRUE,\"All Suppliers\",IF(ISBLANK(VLOOKUP($B$6,Suppliers,2,0))=TRUE,\"\",VLOOKUP($B$6,Suppliers,2,0)))","v":"All Suppliers"}]
[null,null,null,{"$f":"IF(ISBLANK($B$6)=TRUE,\"\",IF(ISNA(VLOOKUP($B$6,Suppliers,3,0))=TRUE,\"\",IF(ISBLANK(VLOOKUP($B$6,Suppliers,3,0))=TRUE,\"\",VLOOKUP($B$6,Suppliers,3,0))))","v":""}]
["Supplier"]
{"$rows_left_out":22}
{"sheet":"Balances","index":12,"n_rows":25,"n_cols":11,"rows_kept":25,"cut":false,"hidden":true,"merged":[]}
[{"$f":"Setup!A1","v":"Example Limited"}]
["Supplier Account Balances",null,null,{"$f":"IF($B$3=DATE(YEAR($B$3),MONTH($B$3)+1,0)=TRUE,DATE(YEAR($B$3),MONTH($B$3)+1-COLUMN(D5)+COLUMN($D5),0),IF(AND(MONTH(DATE(YEAR($B$3),MONTH($B$3)+1-COLUMN(D5)+COLUMN($D5),0))=2,DAY($B$3)>DAY(DATE(YEAR($B$3),MONTH($B$3)+1-COLUMN(D5)+COLUMN($D5),0)))=TRUE,DATE(YEAR($B$3),MONTH($B$3)+1-COLUMN(D5)+COLUMN($D5),0),DATE(YEAR($B$3),MONTH($B$3)-COLUMN(D5)+COLUMN($D5),DAY($B$3))))","v":"2021-03-31"},{"$f":"IF($B$3=DATE(YEAR($B$3),MONTH($B$3)+1,0)=TRUE,DATE(YEAR($B$3),MONTH($B$3)+1-COLUMN(E5)+COLUMN($D5),0),IF(AND(MONTH(DATE(YEAR($B$3),MONTH($B$3)+1-COLUMN(E5)+COLUMN($D5),0))=2,DAY($B$3)>DAY(DATE(YEAR($B$3),MONTH($B$3)+1-COLUMN(E5)+COLUMN($D5),0)))=TRUE,DATE(YEAR($B$3),MONTH($B$3)+1-COLUMN(E5)+COLUMN($D5),0),DATE(YEAR($B$3),MONTH($B$3)-COLUMN(E5)+COLUMN($D5),DAY($B$3))))","v":"2021-02-28"},"2021-01-31","2020-12-31","2020-11-30","2020-10-31","2020-09-30","2020-08-31"]
["Report Date:",{"$f":"IF(ISBLANK(Ageing!$B$4)=TRUE,TODAY(),Ageing!$B$4)","v":"2021-03-31"},null,{"$f":"IF($B$3=DATE(YEAR($B$3),MONTH($B$3)+1,0)=TRUE,DATE(YEAR($B$3),MONTH($B$3)+1-COLUMN(D5)+COLUMN($C5),0),IF(AND(MONTH(DATE(YEAR($B$3),MONTH($B$3)+1-COLUMN(D5)+COLUMN($C5),0))=2,DAY($B$3)>DAY(DATE(YEAR($B$3),MONTH($B$3)+1-COLUMN(D5)+COLUMN($C5),0)))=TRUE,DATE(YEAR($B$3),MONTH($B$3)+1-COLUMN(D5)+COLUMN($C5),0),DATE(YEAR($B$3),MONTH($B$3)-COLUMN(D5)+COLUMN($C5),DAY($B$3))))","v":"2021-02-28"},{"$f":"IF($B$3=DATE(YEAR($B$3),MONTH($B$3)+1,0)=TRUE,DATE(YEAR($B$3),MONTH($B$3)+1-COLUMN(E5)+COLUMN($C5),0),IF(AND(MONTH(DATE(YEAR($B$3),MONTH($B$3)+1-COLUMN(E5)+COLUMN($C5),0))=2,DAY($B$3)>DAY(DATE(YEAR($B$3),MONTH($B$3)+1-COLUMN(E5)+COLUMN($C5),0)))=TRUE,DATE(YEAR($B$3),MONTH($B$3)+1-COLUMN(E5)+COLUMN($C5),0),DATE(YEAR($B$3),MONTH($B$3)-COLUMN(E5)+COLUMN($C5),DAY($B$3))))","v":"2021-01-31"},"2020-12-31","2020-11-30","2020-10-31","2020-09-30","2020-08-31","2020-07-31"]
["© www.excel-skills.co.uk",null,{"$f":"SUBTOTAL(109,OFFSET(C$5,1,0,BalCount,1))","v":6542.080000000009},{"$f":"SUBTOTAL(109,OFFSET(D$5,1,0,BalCount,1))","v":5542.08},{"$f":"SUBTOTAL(109,OFFSET(E$5,1,0,BalCount,1))","v":0},{"$f":"SUBTOTAL(109,OFFSET(F$5,1,0,BalCount,1))","v":1000},{"$f":"SUBTOTAL(109,OFFSET(G$5,1,0,BalCount,1))","v":0},{"$f":"SUBTOTAL(109,OFFSET(H$5,1,0,BalCount,1))","v":0},{"$f":"SUBTOTAL(109,OFFSET(I$5,1,0,BalCount,1))","v":0},{"$f":"SUBTOTAL(109,OFFSET(J$5,1,0,BalCount,1))","v":0},{"$f":"SUBTOTAL(109,OFFSET(K$5,1,0,BalCount,1))","v":0}]
["Code","Billing Name","Balance","Current","30 Days","60 Days","90 Days","120 Days","150 Days","180 Days","+180 Days"]
[{"$f":"IF(OR(ISBLANK(OFFSET(Suppliers!$A$4,ROW(Balances!B6)-ROW(Balances!$B$5),0,1,1))=TRUE,OFFSET(Suppliers!$A$4,ROW(Balances!B6)-ROW(Balances!$B$5),0,1,1)=\"ZZZ\")=TRUE,\"\",OFFSET(Suppliers!$A$4,ROW(Balances!B6)-ROW(Balances!$B$5),0,1,1))","v":"ABC01"},{"$f":"IF(LEN($A6)=0,\"\",OFFSET(Suppliers!$B$4,ROW(Balances!C6)-ROW(Balances!$B$5),0,1,1))","v":"ABC Limited"},{"$f":"IF(LEN($A6)=0,\"\",SUMIFS(InvoiceAmount,Invoice_Number,\"<>\",InvoiceDate,\"<=\"&$B$3,InvoiceSupp,$A6)-SUMIFS(PaymentAmount,Invoice_Number,\"<>\",InvoiceDate,\"<=\"&$B$3,PayDate,\"<=\"&$B$3,InvoiceSupp,$A6))","v":0},{"$f":"IF(LEN($A6)=0,\"\",SUMIFS(InvoiceAmount,Invoice_Number,\"<>\",InvoiceDate,\"<=\"&D$2,InvoiceDate,\">\"&D$3,InvoiceSupp,$A6)-SUMIFS(PaymentAmount,Invoice_Number,\"<>\",InvoiceDate,\"<=\"&D$2,InvoiceDate,\">\"&D$3,PayDate,\"<=\"&$B$3,InvoiceSupp,$A6))","v":0},{"$f":"IF(LEN($A6)=0,\"\",SUMIFS(InvoiceAmount,Invoice_Number,\"<>\",InvoiceDate,\"<=\"&E$2,InvoiceDate,\">\"&E$3,InvoiceSupp,$A6)-SUMIFS(PaymentAmount,Invoice_Number,\"<>\",InvoiceDate,\"<=\"&E$2,InvoiceDate,\">\"&E$3,PayDate,\"<=\"&$B$3,InvoiceSupp,$A6))","v":0},{"$f":"IF(LEN($A6)=0,\"\",SUMIFS(InvoiceAmount,Invoice_Number,\"<>\",InvoiceDate,\"<=\"&F$2,InvoiceDate,\">\"&F$3,InvoiceSupp,$A6)-SUMIFS(PaymentAmount,Invoice_Number,\"<>\",InvoiceDate,\"<=\"&F$2,InvoiceDate,\">\"&F$3,PayDate,\"<=\"&$B$3,InvoiceSupp,$A6))","v":0},{"$f":"IF(LEN($A6)=0,\"\",SUMIFS(InvoiceAmount,Invoice_Number,\"<>\",InvoiceDate,\"<=\"&G$2,InvoiceDate,\">\"&G$3,InvoiceSupp,$A6)-SUMIFS(PaymentAmount,Invoice_Number,\"<>\",InvoiceDate,\"<=\"&G$2,InvoiceDate,\">\"&G$3,PayDate,\"<=\"&$B$3,InvoiceSupp,$A6))","v":0},{"$f":"IF(LEN($A6)=0,\"\",SUMIFS(InvoiceAmount,Invoice_Number,\"<>\",InvoiceDate,\"<=\"&H$2,InvoiceDate,\">\"&H$3,InvoiceSupp,$A6)-SUMIFS(PaymentAmount,Invoice_Number,\"<>\",InvoiceDate,\"<=\"&H$2,InvoiceDate,\">\"&H$3,PayDate,\"<=\"&$B$3,InvoiceSupp,$A6))","v":0},{"$f":"IF(LEN($A6)=0,\"\",SUMIFS(InvoiceAmount,Invoice_Number,\"<>\",InvoiceDate,\"<=\"&I$2,InvoiceDate,\">\"&I$3,InvoiceSupp,$A6)-SUMIFS(PaymentAmount,Invoice_Number,\"<>\",InvoiceDate,\"<=\"&I$2,InvoiceDate,\">\"&I$3,PayDate,\"<=\"&$B$3,InvoiceSupp,$A6))","v":0},{"$f":"IF(LEN($A6)=0,\"\",SUMIFS(InvoiceAmount,Invoice_Number,\"<>\",InvoiceDate,\"<=\"&J$2,InvoiceDate,\">\"&J$3,InvoiceSupp,$A6)-SUMIFS(PaymentAmount,Invoice_Number,\"<>\",InvoiceDate,\"<=\"&J$2,InvoiceDate,\">\"&J$3,PayDate,\"<=\"&$B$3,InvoiceSupp,$A6))","v":0},{"$f":"IF(LEN($A6)=0,\"\",SUMIFS(InvoiceAmount,Invoice_Number,\"<>\",InvoiceDate,\"<=\"&K$2,InvoiceSupp,$A6)-SUMIFS(PaymentAmount,Invoice_Number,\"<>\",InvoiceDate,\"<=\"&K$2,PayDate,\"<=\"&$B$3,InvoiceSupp,$A6))","v":0}]
{"$rows_left_out":20}
{"sheet":"Forecast","index":13,"n_rows":41,"n_cols":5,"rows_kept":41,"cut":false,"hidden":true,"merged":[]}
[{"$f":"Setup!A1","v":"Example Limited"}]
["Supplier Payment Forecast"]
[null,null,null,"Total Overdue",{"$f":"SUMIFS(InvoiceAmount,Invoice_Number,\"<>\",InvoiceDate,\"<\"&$A$6,InvDueDate,\"<\"&$A$6)-SUMIFS(PaymentAmount,Invoice_Number,\"<>\",InvoiceDate,\"<\"&$A$6,InvDueDate,\"<\"&$A$6,PayDate,\"<\"&$A$6)","v":6542.0800000000017}]
["© www.excel-skills.co.uk"]
["Date","Payment Amount",null,"Future Payments","Total"]
[{"$f":"TODAY()+1","v":"2021-05-18"},{"$f":"SUMIFS(InvoiceAmount,Invoice_Number,\"<>\",InvoiceDate,\"<=\"&$A6,InvDueDate,$A6)-SUMIFS(PaymentAmount,Invoice_Number,\"<>\",InvoiceDate,\"<=\"&$A6,PayDate,\"<=\"&$A6,InvDueDate,$A6)","v":0},null,{"$f":"DATE(YEAR($A$6),MONTH($A$6)+1,0)","v":"2021-05-31"},{"$f":"SUMIFS(InvoiceAmount,Invoice_Number,\"<>\",InvoiceDate,\"<=\"&D6,InvDueDate,\"<=\"&D6,InvDueDate,\">=\"&DATE(YEAR(D6),MONTH(D6),1))-SUMIFS(PaymentAmount,Invoice_Number,\"<>\",InvoiceDate,\"<=\"&D6,PayDate,\"<=\"&D6,InvDueDate,\"<=\"&D6,InvDueDate,\">=\"&DATE(YEAR(D6),MONTH(D6),1))","v":0}]
{"$rows_left_out":36}
{"sheet":"ChartInfo","index":14,"n_rows":19,"n_cols":6,"rows_kept":19,"cut":false,"hidden":true,"merged":[]}
[{"$f":"Setup!C5","v":"Example Limited"}]
["Chart Info"]
[]
["Ageing Chart",null,null,"Purchases & Creditors Chart"]
[]
["Ageing","Balance",null,"Month","Purchases","Balance "]
{"$rows_left_out":13}